BDBM50188558 8-(1-(2-fluorobenzyl)-1H-pyrazol-4-yl)-1,3-dipropyl-1H-purine-2,6(3H,7H)-dione::CHEMBL210649
SMILES CCCn1c2nc([nH]c2c(=O)n(CCC)c1=O)-c1cnn(Cc2ccccc2F)c1
InChI Key InChIKey=IFKRZKUTYVNSLN-UHFFFAOYSA-N
Data  3 KI
  Tab Delimited (TSV)   2D SDfile   Computed 3D by Vconf -m prep SDfile
Find this compound or compounds like it in BindingDB:
Activity Spreadsheet -- Enzyme Inhibition Constant Data from BindingDB
Found 3 hits for monomerid = 50188558
TargetAdenosine receptor A1(Homo sapiens (Human))
Cv Therapeutics
Curated by ChEMBL
LigandPNGBDBM50188558(8-(1-(2-fluorobenzyl)-1H-pyrazol-4-yl)-1,3-dipropy...)
Affinity DataKi:  19nM. Assay description: Displacement of [3H]CPX from human adenosine A3 receptor expressed in CHO cells
In DepthDetails ArticlePubMed
TargetAdenosine receptor A2b(Homo sapiens (Human))
Cv Therapeutics
Curated by ChEMBL
LigandPNGBDBM50188558(8-(1-(2-fluorobenzyl)-1H-pyrazol-4-yl)-1,3-dipropy...)
Affinity DataKi:  28nM. Assay description: Displacement of [3H]ZM241385 from human adenosine A2b receptor expressed in HEK cells
In DepthDetails ArticlePubMed
TargetAdenosine receptor A2a(Homo sapiens (Human))
Cv Therapeutics
Curated by ChEMBL
LigandPNGBDBM50188558(8-(1-(2-fluorobenzyl)-1H-pyrazol-4-yl)-1,3-dipropy...)
Affinity DataKi:  60nM. Assay description: Displacement of [3H]ZM241385 from human adenosine A2a receptor expressed in HEK cells
In DepthDetails ArticlePubMed