BDBM50188571 8-(1-(2,4,6-trifluorobenzyl)-1H-pyrazol-4-yl)-1,3-dipropyl-1H-purine-2,6(3H,7H)-dione::CHEMBL378020
SMILES CCCn1c2nc([nH]c2c(=O)n(CCC)c1=O)-c1cnn(Cc2c(F)cc(F)cc2F)c1
InChI Key InChIKey=MNTBZWJTRUMJSU-UHFFFAOYSA-N
Data  1 KI
  Tab Delimited (TSV)   2D SDfile   Computed 3D by Vconf -m prep SDfile
Find this compound or compounds like it in BindingDB:
Activity Spreadsheet -- Enzyme Inhibition Constant Data from BindingDB
Found 1 hit for monomerid = 50188571
TargetAdenosine receptor A2b(Homo sapiens (Human))
Cv Therapeutics
Curated by ChEMBL
LigandPNGBDBM50188571(8-(1-(2,4,6-trifluorobenzyl)-1H-pyrazol-4-yl)-1,3-...)
Affinity DataKi:  650nM. Assay description: Displacement of [3H]ZM241385 from human adenosine A2b receptor expressed in HEK cells
In DepthDetails ArticlePubMed