BDBM50188795 CHEMBL386550::ammonium N-{4-[2,2-bis(3-methyl-1,2,4-oxadiazol-5-yl)-5-phenylpentyl]phenyl}sulfamate
SMILES Cc1noc(n1)C(CCCc1ccccc1)(Cc1ccc(NS([O-])(=O)=O)cc1)c1nc(C)no1
InChI Key InChIKey=MKLXYDUSWQDVEW-UHFFFAOYSA-M
Data  1 IC50
  Tab Delimited (TSV)   2D SDfile   Computed 3D by Vconf -m prep SDfile
Find this compound or compounds like it in BindingDB:
Activity Spreadsheet -- Enzyme Inhibition Constant Data from BindingDB
Found 1 hit for monomerid = 50188795
TargetReceptor-type tyrosine-protein phosphatase beta(Homo sapiens (Human))
Procter & Gamble Pharmaceuticals
Curated by ChEMBL
LigandPNGBDBM50188795(CHEMBL386550 | ammonium N-{4-[2,2-bis(3-methyl-1,2...)
Affinity DataIC50:  70nM. Assay description: Inhibition of HPTPbeta
In DepthDetails ArticlePubMed