BDBM50188838 3-(6-(3-(dimethylamino)pyrrolidin-1-yl)pyridin-3-yl)-7-(4-(trifluoromethyl)pyridin-3-yl)-4H-chromen-4-one::CHEMBL378283
SMILES CN(C)C1CCN(C1)c1ccc(cn1)-c1coc2cc(ccc2c1=O)-c1cnccc1C(F)(F)F
InChI Key InChIKey=RYGNGVJAAJRDMC-UHFFFAOYSA-N
Data  1 KI  1 IC50
  Tab Delimited (TSV)   2D SDfile   Computed 3D by Vconf -m prep SDfile
Find this compound or compounds like it in BindingDB:
Activity Spreadsheet -- Enzyme Inhibition Constant Data from BindingDB
Found 2 hits for monomerid = 50188838
TargetMelanin-concentrating hormone receptor 1(Homo sapiens (Human))
Neurocrine Biosciences
Curated by ChEMBL
LigandPNGBDBM50188838(3-(6-(3-(dimethylamino)pyrrolidin-1-yl)pyridin-3-y...)
Affinity DataKi:  29nM. Assay description: Binding affinity to human MCH1R
In DepthDetails ArticlePubMed
TargetMelanin-concentrating hormone receptor 1(Homo sapiens (Human))
Neurocrine Biosciences
Curated by ChEMBL
LigandPNGBDBM50188838(3-(6-(3-(dimethylamino)pyrrolidin-1-yl)pyridin-3-y...)
Affinity DataIC50:  130nM. Assay description: Activity at human MCH1R by GTPgammaS assay
In DepthDetails ArticlePubMed