BDBM50188903 CHEMBL3827612
SMILES CCn1c(CN(C)c2ncc(cn2)C(=O)NO)nc2c(nc(nc12)-c1ccc(N)cc1)N1CCOCC1
InChI Key InChIKey=LHUYFNVIMYCDID-UHFFFAOYSA-N
Data  2 IC50
  Tab Delimited (TSV)   2D SDfile   Computed 3D by Vconf -m prep SDfile
Find this compound or compounds like it in BindingDB:
Activity Spreadsheet -- Enzyme Inhibition Constant Data from BindingDB
Found 2 hits for monomerid = 50188903
TargetHistone deacetylase 1(Homo sapiens (Human))
West China Hospital Of Sichuan University
Curated by ChEMBL
LigandPNGBDBM50188903(CHEMBL3827612)
Affinity DataIC50:  1.40nM. Assay description: Inhibition of full length C-terminal His/FLAG-tagged human recombinant HDAC1 expressed in baculovirus infected insect Sf9 cells using Ac-peptide-AMC ...
In DepthDetails ArticlePubMed
TargetPhosphatidylinositol 3-kinase regulatory subunit alpha/4,5-bisphosphate 3-kinase catalytic subunit alpha isoform(Homo sapiens (Human))
West China Hospital Of Sichuan University
Curated by ChEMBL
LigandPNGBDBM50188903(CHEMBL3827612)
Affinity DataIC50: >1.00E+3nM. Assay description: Inhibition of full length recombinant human His-tagged p110 alpha/p85 alpha expressed in baculovirus expression system incubated for 1 hr by kinase-g...
In DepthDetails ArticlePubMed