BDBM50188942 CHEMBL212450::N-(2-(2,4-dichlorophenyl)propyl)-5-(2-(methylamino)pyrimidin-4-yl)thiophene-2-carboxamide
SMILES CNc1nccc(n1)-c1ccc(s1)C(=O)NCC(C)c1ccc(Cl)cc1Cl
InChI Key InChIKey=GQFRZDWMXNWNJD-UHFFFAOYSA-N
Data  1 IC50
  Tab Delimited (TSV)   2D SDfile   Computed 3D by Vconf -m prep SDfile
Find this compound or compounds like it in BindingDB:
Activity Spreadsheet -- Enzyme Inhibition Constant Data from BindingDB
Found 1 hit for monomerid = 50188942
TargetRAC-gamma serine/threonine-protein kinase(Homo sapiens (Human))
Chiron
Curated by ChEMBL
LigandPNGBDBM50188942(CHEMBL212450 | N-(2-(2,4-dichlorophenyl)propyl)-5-...)
Affinity DataIC50:  660nM. Assay description: Inhibition of AKT3 in presence of 0.2 uM ATP
In DepthDetails ArticlePubMed