BDBM50189112 CHEMBL383965::N-(4-(3-fluorobenzyloxy)-3-chlorophenyl)-6-(5-((2-(propylsulfonyl)ethylamino)methyl)furan-2-yl)quinazolin-4-amine
SMILES CCCS(=O)(=O)CCNCc1ccc(o1)-c1ccc2ncnc(Nc3ccc(OCc4cccc(F)c4)c(Cl)c3)c2c1
InChI Key InChIKey=ZZOFSNIYKIWAIB-UHFFFAOYSA-N
Data  2 IC50
  Tab Delimited (TSV)   2D SDfile   Computed 3D by Vconf -m prep SDfile
Find this compound or compounds like it in BindingDB:
Activity Spreadsheet -- Enzyme Inhibition Constant Data from BindingDB
Found 2 hits for monomerid = 50189112
TargetEpidermal growth factor receptor(Homo sapiens (Human))
Glaxosmithkline
Curated by ChEMBL
LigandPNGBDBM50189112(CHEMBL383965 | N-(4-(3-fluorobenzyloxy)-3-chloroph...)
Affinity DataIC50:  21nM. Assay description: Inhibition of ErbB1
In DepthDetails ArticlePubMed
TargetReceptor tyrosine-protein kinase erbB-2(Homo sapiens (Human))
Glaxosmithkline
Curated by ChEMBL
LigandPNGBDBM50189112(CHEMBL383965 | N-(4-(3-fluorobenzyloxy)-3-chloroph...)
Affinity DataIC50:  26nM. Assay description: Inhibition of ErbB2
In DepthDetails ArticlePubMed