BDBM50189115 CHEMBL387207::N-(4-(benzyloxy)-3-(trifluoromethyl)phenyl)-6-(5-((2-(methylsulfonyl)ethylamino)methyl)furan-2-yl)quinazolin-4-amine
SMILES CS(=O)(=O)CCNCc1ccc(o1)-c1ccc2ncnc(Nc3ccc(OCc4ccccc4)c(c3)C(F)(F)F)c2c1
InChI Key InChIKey=HBNMFZZQCIPDOK-UHFFFAOYSA-N
Data  2 IC50
  Tab Delimited (TSV)   2D SDfile   Computed 3D by Vconf -m prep SDfile
Find this compound or compounds like it in BindingDB:
Activity Spreadsheet -- Enzyme Inhibition Constant Data from BindingDB
Found 2 hits for monomerid = 50189115
TargetReceptor tyrosine-protein kinase erbB-2(Homo sapiens (Human))
Glaxosmithkline
Curated by ChEMBL
LigandPNGBDBM50189115(CHEMBL387207 | N-(4-(benzyloxy)-3-(trifluoromethyl...)
Affinity DataIC50:  200nM. Assay description: Inhibition of ErbB2
In DepthDetails ArticlePubMed
TargetEpidermal growth factor receptor(Homo sapiens (Human))
Glaxosmithkline
Curated by ChEMBL
LigandPNGBDBM50189115(CHEMBL387207 | N-(4-(benzyloxy)-3-(trifluoromethyl...)
Affinity DataIC50:  160nM. Assay description: Inhibition of ErbB1
In DepthDetails ArticlePubMed