BDBM50189124 CHEMBL213818::N-(4-(3-fluorobenzyloxy)phenyl)-6-(5-((2-(methylsulfonyl)ethylamino)methyl)furan-2-yl)quinazolin-4-amine
SMILES CS(=O)(=O)CCNCc1ccc(o1)-c1ccc2ncnc(Nc3ccc(OCc4cccc(F)c4)cc3)c2c1
InChI Key InChIKey=RZEMPBRXCDBLDH-UHFFFAOYSA-N
Data  2 IC50
  Tab Delimited (TSV)   2D SDfile   Computed 3D by Vconf -m prep SDfile
Find this compound or compounds like it in BindingDB:
Activity Spreadsheet -- Enzyme Inhibition Constant Data from BindingDB
Found 2 hits for monomerid = 50189124
TargetReceptor tyrosine-protein kinase erbB-2(Homo sapiens (Human))
Glaxosmithkline
Curated by ChEMBL
LigandPNGBDBM50189124(CHEMBL213818 | N-(4-(3-fluorobenzyloxy)phenyl)-6-(...)
Affinity DataIC50:  31nM. Assay description: Inhibition of ErbB2
In DepthDetails ArticlePubMed
TargetEpidermal growth factor receptor(Homo sapiens (Human))
Glaxosmithkline
Curated by ChEMBL
LigandPNGBDBM50189124(CHEMBL213818 | N-(4-(3-fluorobenzyloxy)phenyl)-6-(...)
Affinity DataIC50:  24nM. Assay description: Inhibition of ErbB1
In DepthDetails ArticlePubMed