BDBM50189400 CHEMBL213914::N-[(1S)-3-[2'-(2-methyl-1H-1,3-benzodiazol-1-yl)-7-azaspiro[bicyclo[2.2.1]heptane-2,1'-cyclopropane]-7-yl]-1-phenylpropyl]cyclobutanecarboxamide
SMILES Cc1nc2ccccc2n1C1CC11CC2CCC1N2CC[C@H](NC(=O)C1CCC1)c1ccccc1
InChI Key InChIKey=BJENQUZWMHDDIJ-GVCKKYRWSA-N
Data  1 IC50
  Tab Delimited (TSV)   2D SDfile   Computed 3D by Vconf -m prep SDfile
Find this compound or compounds like it in BindingDB:
Activity Spreadsheet -- Enzyme Inhibition Constant Data from BindingDB
Found 1 hit for monomerid = 50189400
TargetC-C chemokine receptor type 5(Homo sapiens (Human))
Pfizer
Curated by ChEMBL
LigandPNGBDBM50189400(CHEMBL213914 | N-[(1S)-3-[2'-(2-methyl-1H-1,3-benz...)
Affinity DataIC50:  6nM. Assay description: Inhibition of [125I]MIP-1beta binding to CCR5 expressed in HEK293 cells
In DepthDetails ArticlePubMed