BDBM50189429 CHEMBL3827666
SMILES COC1CN(C1)c1ccc2cncc(-c3ccc(cc3)-c3cnn(C)c3)c2n1
InChI Key InChIKey=SLMBTUSZZKPYMQ-UHFFFAOYSA-N
Data  2 IC50
  Tab Delimited (TSV)   2D SDfile   Computed 3D by Vconf -m prep SDfile
Find this compound or compounds like it in BindingDB:
Activity Spreadsheet -- Enzyme Inhibition Constant Data from BindingDB
Found 2 hits for monomerid = 50189429
TargetCyclin-C(Homo sapiens (Human))
The Institute Of Cancer Research
Curated by ChEMBL
LigandPNGBDBM50189429(CHEMBL3827666)
Affinity DataIC50:  816nM. Assay description: Competitive binding affinity to full length His-tagged human recombinant CDK8/cyclin C expressed in baculovirus after 20 mins in presence of Alexa647...
In DepthDetails ArticlePubMed
TargetCyclin-dependent kinase 8(Homo sapiens (Human))
The Institute Of Cancer Research
Curated by ChEMBL
LigandPNGBDBM50189429(CHEMBL3827666)
Affinity DataIC50:  1.42E+3nM. Assay description: Binding affinity to CDK8 (unknown origin) expressed in human 7dF3 cells preincubated for 2 hrs followed by beta-oestradiol addition measured after 24...
In DepthDetails ArticlePubMed