BDBM50189484 3-biphenyl-4-yl-7-chloro-4-hydroxy-6-nitro-1H-quinolin-2-one::CHEMBL379396
SMILES Oc1c(-c2ccc(cc2)-c2ccccc2)c(=O)[nH]c2cc(Cl)c(cc12)[N+]([O-])=O
InChI Key InChIKey=BXMYJTIFARIDOU-UHFFFAOYSA-N
Data  1 IC50
  Tab Delimited (TSV)   2D SDfile   Computed 3D by Vconf -m prep SDfile
Find this compound or compounds like it in BindingDB:
Activity Spreadsheet -- Enzyme Inhibition Constant Data from BindingDB
Found 1 hit for monomerid = 50189484
TargetFatty acid synthase(Rattus norvegicus)
Merck Research Laboratories
Curated by ChEMBL
LigandPNGBDBM50189484(3-biphenyl-4-yl-7-chloro-4-hydroxy-6-nitro-1H-quin...)
Affinity DataIC50:  122nM. Assay description: Inhibition of rat FAS
In DepthDetails ArticlePubMed