BDBM50189485 3-biphenyl-3-yl-7-chloro-4-hydroxy-2-oxo-1,2-dihydro-quinoline-6-carbonitrile::CHEMBL375390
SMILES Oc1c(-c2cccc(c2)-c2ccccc2)c(=O)[nH]c2cc(Cl)c(cc12)C#N
InChI Key InChIKey=ZAWULWHMQQDEDS-UHFFFAOYSA-N
Data  1 IC50
  Tab Delimited (TSV)   2D SDfile   Computed 3D by Vconf -m prep SDfile
Find this compound or compounds like it in BindingDB:
Activity Spreadsheet -- Enzyme Inhibition Constant Data from BindingDB
Found 1 hit for monomerid = 50189485
TargetFatty acid synthase(Homo sapiens (Human))
Merck Research Laboratories
Curated by ChEMBL
LigandPNGBDBM50189485(3-biphenyl-3-yl-7-chloro-4-hydroxy-2-oxo-1,2-dihyd...)
Affinity DataIC50:  52nM. Assay description: Inhibition of human FAS
In DepthDetails ArticlePubMed