BDBM50189510 CHEMBL3827526
SMILES CCCCCCCCCc1nc(O)cc(O)n1
InChI Key InChIKey=PCTASNXYTJZGDA-UHFFFAOYSA-N
Data  1 EC50
  Tab Delimited (TSV)   2D SDfile   Computed 3D by Vconf -m prep SDfile
Find this compound or compounds like it in BindingDB:
Activity Spreadsheet -- Enzyme Inhibition Constant Data from BindingDB
Found 1 hit for monomerid = 50189510
TargetG-protein coupled receptor 84(Homo sapiens (Human))
East China Normal University
Curated by ChEMBL
LigandPNGBDBM50189510(CHEMBL3827526)
Affinity DataEC50:  49nM. Assay description: Agonist activity at GPR84 (unknown origin) expressed in HEK293 cells coexpressing Galpha16 protein by Fluo-4 AM dye based calcium mobilization assay
In DepthDetails ArticlePubMed