BDBM50189518 (S)-1-((S)-5-(tert-butoxycarbonyl)-4-oxo-6-phenylhexanoyl)pyrrolidine-2-carboxylic acid::CHEMBL386032
SMILES CC(C)(C)OC(=O)N[C@@H](Cc1ccccc1)C(=O)CCC(=O)N1CCC[C@H]1C(O)=O
InChI Key InChIKey=LSOINDCCNZYVMS-IRXDYDNUSA-N
Data  2 KI
  Tab Delimited (TSV)   2D SDfile   Computed 3D by Vconf -m prep SDfile
Find this compound or compounds like it in BindingDB:
Activity Spreadsheet -- Enzyme Inhibition Constant Data from BindingDB
Found 2 hits for monomerid = 50189518
TargetAngiotensin-converting enzyme(Homo sapiens (Human))
University Of Cape Town
Curated by ChEMBL
LigandPNGBDBM50189518((S)-1-((S)-5-(tert-butoxycarbonyl)-4-oxo-6-phenylh...)
Affinity DataKi:  3.36E+4nM. Assay description: Inhibition of recombinant ACE N domain
In DepthDetails ArticlePubMed
TargetAngiotensin-converting enzyme(Oryctolagus cuniculus)
University Of Cape Town
Curated by ChEMBL
LigandPNGBDBM50189518((S)-1-((S)-5-(tert-butoxycarbonyl)-4-oxo-6-phenylh...)
Affinity DataKi:  1.44E+5nM. Assay description: Inhibition of rabbit testis recombinant ACE C domain
In DepthDetails ArticlePubMed