BDBM50189890 CHEMBL3828739
SMILES [Br-].CN(C)C(=O)Oc1c(C)[n+](C)cc2COC(C)(C)OCc12
InChI Key InChIKey=VNVYSHREEYTISA-UHFFFAOYSA-M
Data  2 IC50
  Tab Delimited (TSV)   2D SDfile   Computed 3D by Vconf -m prep SDfile
Find this compound or compounds like it in BindingDB:
Activity Spreadsheet -- Enzyme Inhibition Constant Data from BindingDB
Found 2 hits for monomerid = 50189890
TargetAcetylcholinesterase(Homo sapiens (Human))
Kazan (Volga Region) Federal University
Curated by ChEMBL
LigandPNGBDBM50189890(CHEMBL3828739)
Affinity DataIC50:  5.00E+5nM. Assay description: Inhibition of human AChE assessed as acetylthiocholine hydrolysis preincubated for 10 mins followed by addition of substrate measured after 2 mins by...
In DepthDetails ArticlePubMed
TargetCholinesterase(Homo sapiens (Human))
Kazan (Volga Region) Federal University
Curated by ChEMBL
LigandPNGBDBM50189890(CHEMBL3828739)
Affinity DataIC50:  1.19E+6nM. Assay description: Inhibition of human plasma BChE assessed as butyrylthiocholine hydrolysis preincubated for 10 mins followed by addition of substrate measured after 2...
In DepthDetails ArticlePubMed