BDBM50189937 (S)-N-[3'-(4-amino-1H-pyrrolo[3,2-c]pyridin-2-yl)-2'-hydroxy-biphenyl-3-ylmethyl]-2-hydroxy-3-phenyl-propionamide::CHEMBL212401
SMILES Nc1nccc2[nH]c(cc12)-c1cccc(-c2cccc(CNC(=O)[C@@H](O)Cc3ccccc3)c2)c1O
InChI Key InChIKey=DNGUAOFFZUMTKG-SANMLTNESA-N
Data  3 KI
  Tab Delimited (TSV)   2D SDfile   Computed 3D by Vconf -m prep SDfile
Find this compound or compounds like it in BindingDB:
Activity Spreadsheet -- Enzyme Inhibition Constant Data from BindingDB
Found 3 hits for monomerid = 50189937
TargetCoagulation factor VII/Tissue factor(Homo sapiens (Human))
Celera Genomics
Curated by ChEMBL
LigandPNGBDBM50189937((S)-N-[3'-(4-amino-1H-pyrrolo[3,2-c]pyridin-2-yl)-...)
Affinity DataKi:  81nM. Assay description: Binding affinity to f7a/TF complex
In DepthDetails ArticlePubMed
TargetCoagulation factor X(Homo sapiens (Human))
Celera Genomics
Curated by ChEMBL
LigandPNGBDBM50189937((S)-N-[3'-(4-amino-1H-pyrrolo[3,2-c]pyridin-2-yl)-...)
Affinity DataKi:  5.40E+4nM. Assay description: Binding affinity to f10a
In DepthDetails ArticlePubMed
TargetProthrombin(Homo sapiens (Human))
Celera Genomics
Curated by ChEMBL
LigandPNGBDBM50189937((S)-N-[3'-(4-amino-1H-pyrrolo[3,2-c]pyridin-2-yl)-...)
Affinity DataKi:  9.90E+4nM. Assay description: Binding affinity to thrombin
In DepthDetails ArticlePubMed