BDBM50189960 1-(4-hydroxyphenyl)butan-1-one::CHEMBL214150
SMILES CCCC(=O)c1ccc(O)cc1
InChI Key InChIKey=GFBLPULLSAPXDC-UHFFFAOYSA-N
Data  1 IC50
  Tab Delimited (TSV)   2D SDfile   Computed 3D by Vconf -m prep SDfile
Find this compound or compounds like it in BindingDB:
Activity Spreadsheet -- Enzyme Inhibition Constant Data from BindingDB
Found 1 hit for monomerid = 50189960
Target17-beta-hydroxysteroid dehydrogenase type 3(Homo sapiens (Human))
Kingston University
Curated by ChEMBL
LigandPNGBDBM50189960(1-(4-hydroxyphenyl)butan-1-one | CHEMBL214150)
Affinity DataIC50:  8.95E+4nM. Assay description: Inhibition of 17beta-HSD3
In DepthDetails ArticlePubMed