BDBM50190174 CHEMBL3827726
SMILES Cc1nc2ccccc2n1CC(=O)NNC(=O)c1c[nH]c2ccccc12
InChI Key InChIKey=ZMEGDUXXKAWMLA-UHFFFAOYSA-N
Data  1 IC50
  Tab Delimited (TSV)   2D SDfile   Computed 3D by Vconf -m prep SDfile
Find this compound or compounds like it in BindingDB:
Activity Spreadsheet -- Enzyme Inhibition Constant Data from BindingDB
Found 1 hit for monomerid = 50190174
TargetGlycogen synthase kinase-3 beta(Homo sapiens (Human))
Jamia Hamdard (Hamdard University)
Curated by ChEMBL
LigandPNGBDBM50190174(CHEMBL3827726)
Affinity DataIC50:  148nM. Assay description: Inhibition of recombinant human N-terminal His-tagged GSK-3beta expressed in Escherichia coli using glycogen synthase-2 as substrate and ATP measured...
In DepthDetails ArticlePubMed