BDBM50190195 3,5-dichloro-N-[8-chloro-11-(4-methyl-piperazin-1-yl)-dibenzo[b,e][1,4]diazepin-5-yl]-benzamide::CHEMBL427230
SMILES CN1CCN(CC1)C1=Nc2cc(Cl)ccc2N(NC(=O)c2cc(Cl)cc(Cl)c2)c2ccccc12
InChI Key InChIKey=OLBITTLQHVXSOM-UHFFFAOYSA-N
Data  2 KI
  Tab Delimited (TSV)   2D SDfile   Computed 3D by Vconf -m prep SDfile
Find this compound or compounds like it in BindingDB:
Activity Spreadsheet -- Enzyme Inhibition Constant Data from BindingDB
Found 2 hits for monomerid = 50190195
TargetD(1A) dopamine receptor(Homo sapiens (Human))
Schering-Plough Research Institute
Curated by ChEMBL
LigandPNGBDBM50190195(3,5-dichloro-N-[8-chloro-11-(4-methyl-piperazin-1-...)
Affinity DataKi:  24nM. Assay description: Displacement of [3H]SCH 23390 from human dopamine D1 receptor expressed in CHO cells
In DepthDetails ArticlePubMed
TargetD(2) dopamine receptor(Homo sapiens (Human))
Schering-Plough Research Institute
Curated by ChEMBL
LigandPNGBDBM50190195(3,5-dichloro-N-[8-chloro-11-(4-methyl-piperazin-1-...)
Affinity DataKi:  608nM. Assay description: Displacement of [3H]methylspiperone from human dopamine D2 receptor expressed in CHO cells
In DepthDetails ArticlePubMed