BDBM50190346 CHEMBL3827497
SMILES CN(C)c1ccc(\C=C2/N(C)C(=S)N(C3CCCCC3)C2=O)cc1
InChI Key InChIKey=XQNWEBDHUKPBFV-LGMDPLHJSA-N
Data  2 KI
  Tab Delimited (TSV)   2D SDfile   Computed 3D by Vconf -m prep SDfile
Find this compound or compounds like it in BindingDB:
Activity Spreadsheet -- Enzyme Inhibition Constant Data from BindingDB
Found 2 hits for monomerid = 50190346
TargetNADPH oxidase 1(Homo sapiens (Human))
Ewha Womans University
Curated by ChEMBL
LigandPNGBDBM50190346(CHEMBL3827497)
Affinity DataKi:  1.23E+4nM. Assay description: Inhibition of human NOX1 expressed in Drosophila DUOX knockdown model assessed as decrease in ROS production by lucigenin chemiluminescence assay
In DepthDetails ArticlePubMed
TargetNADPH oxidase 4(Homo sapiens (Human))
Ewha Womans University
Curated by ChEMBL
LigandPNGBDBM50190346(CHEMBL3827497)
Affinity DataKi:  3.56E+4nM. Assay description: Inhibition of human NOX4 expressed in Drosophila DUOX knockdown model assessed as decrease in ROS production by lucigenin chemiluminescence assay
In DepthDetails ArticlePubMed