BDBM50190371 1-{3-[4-(tert-butyl)phenyl]-5-[2-(N,N-dimethylamino)ethyl]-(1,2,4-triazol-4-yl)}-3-phenol::CHEMBL377786
SMILES CN(C)CCc1nnc(-c2ccc(cc2)C(C)(C)C)n1-c1cccc(O)c1
InChI Key InChIKey=GXCHDJZRSKYWDS-UHFFFAOYSA-N
Data  3 KI
  Tab Delimited (TSV)   2D SDfile   Computed 3D by Vconf -m prep SDfile
Find this compound or compounds like it in BindingDB:
Activity Spreadsheet -- Enzyme Inhibition Constant Data from BindingDB
Found 3 hits for monomerid = 50190371
TargetDelta-type opioid receptor(Homo sapiens (Human))
University Of Medicine And Dentistry Of New Jersey And Umdnj Informatics Institute
Curated by ChEMBL
LigandPNGBDBM50190371(1-{3-[4-(tert-butyl)phenyl]-5-[2-(N,N-dimethylamin...)
Affinity DataKi:  900nM. Assay description: Inhibition of (-)-[9-3H]bremazocine binding to delta opioid receptor expressed in HEK293 cells
In DepthDetails ArticlePubMed
TargetMu-type opioid receptor(Homo sapiens (Human))
University Of Medicine And Dentistry Of New Jersey And Umdnj Informatics Institute
Curated by ChEMBL
LigandPNGBDBM50190371(1-{3-[4-(tert-butyl)phenyl]-5-[2-(N,N-dimethylamin...)
Affinity DataKi: >1.00E+4nM. Assay description: Inhibition of (-)-[9-3H]bremazocine binding to mu opioid receptor expressed in HEK293 cells
In DepthDetails ArticlePubMed
TargetKappa-type opioid receptor(Homo sapiens (Human))
University Of Medicine And Dentistry Of New Jersey And Umdnj Informatics Institute
Curated by ChEMBL
LigandPNGBDBM50190371(1-{3-[4-(tert-butyl)phenyl]-5-[2-(N,N-dimethylamin...)
Affinity DataKi: >1.00E+4nM. Assay description: Inhibition of (-)-[9-3H]bremazocine binding to kappa opioid receptor expressed in HEK293 cells
In DepthDetails ArticlePubMed