BDBM50190440 4-Ethyl-5-ethylsulfanylcarbonyl-2-phenyl-6-propyl-nicotinic acid ethyl ester::CHEMBL322524::ethyl 4-ethyl-5-(ethylthiocarbonyl)-2-phenyl-6-propylnicotinate
SMILES CCCc1nc(-c2ccccc2)c(C(=O)OCC)c(CC)c1C(=O)SCC
InChI Key InChIKey=GSMBGLUYORHXJR-UHFFFAOYSA-N
Data  1 KI
  Tab Delimited (TSV)   2D SDfile   Computed 3D by Vconf -m prep SDfile
Find this compound or compounds like it in BindingDB:
Activity Spreadsheet -- Enzyme Inhibition Constant Data from BindingDB
Found 1 hit for monomerid = 50190440
TargetAdenosine receptor A3(Homo sapiens (Human))
Università
Curated by ChEMBL
LigandPNGBDBM50190440(4-Ethyl-5-ethylsulfanylcarbonyl-2-phenyl-6-propyl-...)
Affinity DataKi:  33.3nM. Assay description: Displacement of [3H]MRE 3008F20 from human adenosine A3 receptor expressed in CHO cells
In DepthDetails ArticlePubMed