BDBM50190481 CHEMBL214239::N-(3,5-diamino-6-chloropyrazine-2-carbonyl)-N'-[4-(4-hydroxymethylphenyl)-butyl]guanidine
SMILES NC(NC(=O)c1nc(Cl)c(N)nc1N)=NCCCCc1ccc(CO)cc1
InChI Key InChIKey=UMMUTUNDKHFNFP-UHFFFAOYSA-N
Data  1 IC50
  Tab Delimited (TSV)   2D SDfile   Computed 3D by Vconf -m prep SDfile
Find this compound or compounds like it in BindingDB:
Activity Spreadsheet -- Enzyme Inhibition Constant Data from BindingDB
Found 1 hit for monomerid = 50190481
TargetAmiloride-sensitive sodium channel subunit alpha(Homo sapiens (Human))
Parion Sciences
Curated by ChEMBL
LigandPNGBDBM50190481(CHEMBL214239 | N-(3,5-diamino-6-chloropyrazine-2-c...)
Affinity DataIC50:  14nM. Assay description: Inhibition of dog bronchi prototypical epithelial sodium channel by electrophysiological assay
In DepthDetails ArticlePubMed