BDBM50190489 (4-{4-[N-(3,5-diamino-6-chloropyrazine-2-carbonyl)guanidino]-butyl}phenoxy)propionic acid::CHEMBL379433
SMILES NC(NC(=O)c1nc(Cl)c(N)nc1N)=NCCCCc1ccc(OCCC(O)=O)cc1
InChI Key InChIKey=OBEIEHDVAGSDIV-UHFFFAOYSA-N
Data  1 IC50
  Tab Delimited (TSV)   2D SDfile   Computed 3D by Vconf -m prep SDfile
Find this compound or compounds like it in BindingDB:
Activity Spreadsheet -- Enzyme Inhibition Constant Data from BindingDB
Found 1 hit for monomerid = 50190489
TargetAmiloride-sensitive sodium channel subunit alpha(Homo sapiens (Human))
Parion Sciences
Curated by ChEMBL
LigandPNGBDBM50190489((4-{4-[N-(3,5-diamino-6-chloropyrazine-2-carbonyl)...)
Affinity DataIC50:  20nM. Assay description: Inhibition of dog bronchi prototypical epithelial sodium channel by electrophysiological assay
In DepthDetails ArticlePubMed