BDBM50190894 2-(1-(1-cyclopentylpiperidin-4-yl)-6-(2,5-dichlorophenyl)-3,4-dihydroisoquinolin-2(1H)-yl)-N-(3,5-dichlorophenyl)acetamide::CHEMBL384116
SMILES Clc1ccc(Cl)c(c1)-c1ccc2C(C3CCN(CC3)C3CCCC3)N(CC(=O)Nc3cc(Cl)cc(Cl)c3)CCc2c1
InChI Key InChIKey=AOGVTUDRZQZUJZ-UHFFFAOYSA-N
Data  1 KI
  Tab Delimited (TSV)   2D SDfile   Computed 3D by Vconf -m prep SDfile
Find this compound or compounds like it in BindingDB:
Activity Spreadsheet -- Enzyme Inhibition Constant Data from BindingDB
Found 1 hit for monomerid = 50190894
TargetMelanin-concentrating hormone receptor 1(Homo sapiens (Human))
Schering-Plough Research Institute
Curated by ChEMBL
LigandPNGBDBM50190894(2-(1-(1-cyclopentylpiperidin-4-yl)-6-(2,5-dichloro...)
Affinity DataKi:  87nM. Assay description: Binding affinity to human MCHR1
In DepthDetails ArticlePubMed