BDBM50190905 2-[6-(3-cyano-phenyl)-1'-isopropyl-3,4-dihydro-spiro[isoquinoline-1,4'-piperidin]-2-yl]-N-(3,5-dichloro-phenyl)-acetamide::CHEMBL213491
SMILES CC(C)N1CCC2(CC1)N(CC(=O)Nc1cc(Cl)cc(Cl)c1)CCc1cc(ccc21)-c1cccc(c1)C#N
InChI Key InChIKey=AIHWMRGISSLYBL-UHFFFAOYSA-N
Data  1 KI
  Tab Delimited (TSV)   2D SDfile   Computed 3D by Vconf -m prep SDfile
Find this compound or compounds like it in BindingDB:
Activity Spreadsheet -- Enzyme Inhibition Constant Data from BindingDB
Found 1 hit for monomerid = 50190905
TargetMelanin-concentrating hormone receptor 1(Homo sapiens (Human))
Schering-Plough Research Institute
Curated by ChEMBL
LigandPNGBDBM50190905(2-[6-(3-cyano-phenyl)-1'-isopropyl-3,4-dihydro-spi...)
Affinity DataKi:  29nM. Assay description: Binding affinity to human MCHR1
In DepthDetails ArticlePubMed