BDBM50191097 CHEMBL214472::N-((1R,2S,3S)-3-((R)-1-(3,5-bis(trifluoromethyl)phenyl)ethoxy)-2-(4-fluorophenyl)cyclopentyl)-N-methylpyrazin-2-amine
SMILES C[C@@H](O[C@H]1CC[C@H]([C@@H]1c1ccc(F)cc1)N(C)c1cnccn1)c1cc(cc(c1)C(F)(F)F)C(F)(F)F
InChI Key InChIKey=CPYUQXLLIOFGQM-LMIIYESCSA-N
Data  1 IC50
  Tab Delimited (TSV)   2D SDfile   Computed 3D by Vconf -m prep SDfile
Find this compound or compounds like it in BindingDB:
Activity Spreadsheet -- Enzyme Inhibition Constant Data from BindingDB
Found 1 hit for monomerid = 50191097
TargetSubstance-P receptor(Homo sapiens (Human))
Merck Research Laboratories
Curated by ChEMBL
LigandPNGBDBM50191097(CHEMBL214472 | N-((1R,2S,3S)-3-((R)-1-(3,5-bis(tri...)
Affinity DataIC50:  1.40nM. Assay description: Displacement of [125I]SP from human cloned NK1 receptor expressed in CHO cells
In DepthDetails ArticlePubMed