BDBM50191145 2-(3-(4-methoxyphenoxy)prop-1-ynyl)-6-methylpyridine::CHEMBL215861
SMILES COc1ccc(OCC#Cc2cccc(C)n2)cc1
InChI Key InChIKey=IBKAUQIOBRBTMT-UHFFFAOYSA-N
Data  1 IC50
  Tab Delimited (TSV)   2D SDfile   Computed 3D by Vconf -m prep SDfile
Find this compound or compounds like it in BindingDB:
Activity Spreadsheet -- Enzyme Inhibition Constant Data from BindingDB
Found 1 hit for monomerid = 50191145
TargetMetabotropic glutamate receptor 5(Homo sapiens (Human))
Astrazeneca R & D M£Lndal
Curated by ChEMBL
LigandPNGBDBM50191145(2-(3-(4-methoxyphenoxy)prop-1-ynyl)-6-methylpyridi...)
Affinity DataIC50:  455nM. Assay description: Activity at human mGluR5 assessed as effect on glutamate-induced calcium ion mobilization by FLIPR
In DepthDetails ArticlePubMed