BDBM50191292 2-(4-(3-(2-amino-4-hydroxypteridin-6-yl)propylamino)benzamido)pentanedioic acid::CHEMBL426146
SMILES Nc1nc2ncc(CCCNc3ccc(cc3)C(=O)NC(CCC(O)=O)C(O)=O)nc2c(=O)[nH]1
InChI Key InChIKey=LMPIPZMUJJNMSV-UHFFFAOYSA-N
Data  1 IC50
  Tab Delimited (TSV)   2D SDfile   Computed 3D by Vconf -m prep SDfile
Find this compound or compounds like it in BindingDB:
Activity Spreadsheet -- Enzyme Inhibition Constant Data from BindingDB
Found 1 hit for monomerid = 50191292
TargetIntegrin alpha-V/beta-3(Homo sapiens (Human))
University Of Southern California
Curated by ChEMBL
LigandPNGBDBM50191292(2-(4-(3-(2-amino-4-hydroxypteridin-6-yl)propylamin...)
Affinity DataIC50:  52nM. Assay description: Inhibition of [125I]echistatin binding to integrin alphaVbeta3 receptor
In DepthDetails ArticlePubMed