BDBM50191320 CHEMBL3945401
SMILES OS(=O)(=O)O[C@H]1[C@H](OS(O)(=O)=O)[C@@H](OS(O)(=O)=O)[C@H](OS(O)(=O)=O)[C@H](OS(O)(=O)=O)[C@@H]1OS(O)(=O)=O
InChI Key InChIKey=NBTMNFYXJYCQHQ-GPIVLXJGSA-N
Data  1 IC50
PDB links: 18 PDB IDs match this monomer.
  Tab Delimited (TSV)   2D SDfile   Computed 3D by Vconf -m prep SDfile
Find this compound or compounds like it in BindingDB:
Activity Spreadsheet -- Enzyme Inhibition Constant Data from BindingDB
Found 1 hit for monomerid = 50191320
TargetBeta-adrenergic receptor kinase 1(Bos taurus)
Universit£
Curated by ChEMBL
LigandPNGBDBM50191320(CHEMBL3945401)
Affinity DataIC50:  1.35E+4nM. Assay description: Inhibition of bovine cerebral cortex GRK2 assessed as decrease in rhodopsin phosphorylation by SDS-PAGE analysis
In DepthDetails ArticlePubMed