BDBM50191423 (2'Z,3'E)-7-bromoindirubin-3'-[O-(N,N-diethylcarbamyl)-oxime::CHEMBL378485
SMILES CCN(CC)C(=O)O\N=C1\C(=Nc2ccccc12)c1c(O)[nH]c2c(Br)cccc12
InChI Key InChIKey=HWIGJKIKGXHGPB-XIEYBQDHSA-N
Data  1 IC50
  Tab Delimited (TSV)   2D SDfile   Computed 3D by Vconf -m prep SDfile
Find this compound or compounds like it in BindingDB:
Activity Spreadsheet -- Enzyme Inhibition Constant Data from BindingDB
Found 1 hit for monomerid = 50191423
TargetCyclin-dependent kinase 5 activator 1(Homo sapiens (Human))
Cnrs
Curated by ChEMBL
LigandPNGBDBM50191423((2'Z,3'E)-7-bromoindirubin-3'-[O-(N,N-diethylcarba...)
Affinity DataIC50: >1.00E+5nM. Assay description: Inhibition of mammalian CDK5/p25
In DepthDetails ArticlePubMed