BDBM50191426 (2'Z,3'E)-7-bromoindirubin-3'-[O-(2-imidazol-1-ylethyl)oxime::CHEMBL211093::CHEMBL213401
SMILES Oc1[nH]c2c(Br)cccc2c1C1=Nc2ccccc2\C1=N/OCCn1ccnc1
InChI Key InChIKey=GWHRAAIHKDKRTQ-LGUFXXKBSA-N
Data  2 IC50
  Tab Delimited (TSV)   2D SDfile   Computed 3D by Vconf -m prep SDfile
Find this compound or compounds like it in BindingDB:
Activity Spreadsheet -- Enzyme Inhibition Constant Data from BindingDB
Found 2 hits for monomerid = 50191426
TargetCyclin-dependent kinase 5 activator 1(Homo sapiens (Human))
Cnrs
Curated by ChEMBL
LigandPNGBDBM50191426((2'Z,3'E)-7-bromoindirubin-3'-[O-(2-imidazol-1-yle...)
Affinity DataIC50: >1.00E+4nM. Assay description: Inhibition of mammalian CDK5/p25
In DepthDetails ArticlePubMed
TargetCyclin-dependent kinase 5 activator 1(Homo sapiens (Human))
Cnrs
Curated by ChEMBL
LigandPNGBDBM50191426((2'Z,3'E)-7-bromoindirubin-3'-[O-(2-imidazol-1-yle...)
Affinity DataIC50: >1.00E+4nM. Assay description: Inhibition of mammalian CDK5/p25
In DepthDetails ArticlePubMed