BDBM50191464 CHEMBL212749::methyl (2S)-2-[(2S)-2-[(2S)-2-(4-{[7-(3-{[(2S)-1-[(5-acetamido-2-methoxyphenyl)formohydrazido]-3-methyl-1-oxobutan-2-yl]carbamoyl}propoxy)naphthalen-2-yl]oxy}butanamido)-3-methylbutanamido]-4-methylpentanamido]-3-methylbutanoate
SMILES COC(=O)[C@@H](NC(=O)[C@H](CC(C)C)NC(=O)[C@@H](NC(=O)CCCOc1ccc2ccc(OCCCC(=O)N[C@@H](C(C)C)C(=O)NNC(=O)c3cc(NC(C)=O)ccc3OC)cc2c1)C(C)C)C(C)C
InChI Key InChIKey=PZNQVYNNPGQNCM-HVWIWKRUSA-N
Data  1 KI
  Tab Delimited (TSV)   2D SDfile   Computed 3D by Vconf -m prep SDfile
Find this compound or compounds like it in BindingDB:
Activity Spreadsheet -- Enzyme Inhibition Constant Data from BindingDB
Found 1 hit for monomerid = 50191464
TargetGag-Pol polyprotein [489-587](Human immunodeficiency virus type 1)
Paris-Sud University
Curated by ChEMBL
LigandPNGBDBM50191464(CHEMBL212749 | methyl (2S)-2-[(2S)-2-[(2S)-2-(4-{[...)
Affinity DataKi:  200nM. Assay description: Inhibition of wild type HIV1 protease dimerization
In DepthDetails ArticlePubMed