BDBM50191758 4'-fluoro-biphenyl-4-carboxylic acid (3-morpholin-4-ylmethyl-quinolin-8-ylmethyl)-amide::CHEMBL214547
SMILES Fc1ccc(cc1)-c1ccc(cc1)C(=O)NCc1cccc2cc(CN3CCOCC3)cnc12
InChI Key InChIKey=CYGWVWRDYSVELO-UHFFFAOYSA-N
Data  1 KI  1 IC50
  Tab Delimited (TSV)   2D SDfile   Computed 3D by Vconf -m prep SDfile
Find this compound or compounds like it in BindingDB:
Activity Spreadsheet -- Enzyme Inhibition Constant Data from BindingDB
Found 2 hits for monomerid = 50191758
TargetMelanin-concentrating hormone receptor 1(Homo sapiens (Human))
Procter And Gamble Pharmaceuticals
Curated by ChEMBL
LigandPNGBDBM50191758(4'-fluoro-biphenyl-4-carboxylic acid (3-morpholin-...)
Affinity DataKi:  1.41E+3nM. Assay description: Binding affinity to MCHR1 by radioligand binding assay
In DepthDetails ArticlePubMed
Target5-hydroxytryptamine receptor 2C(Homo sapiens (Human))
Procter And Gamble Pharmaceuticals
Curated by ChEMBL
LigandPNGBDBM50191758(4'-fluoro-biphenyl-4-carboxylic acid (3-morpholin-...)
Affinity DataIC50:  7.47E+3nM. Assay description: Displacement of [3H]mesulergine from 5HT2C receptor
In DepthDetails ArticlePubMed