BDBM50191892 5-{4-[(3-adamantan-1-yl-ureido)-methyl]-piperidin-1-yl}-5-oxo-pentanoic acid methyl ester::CHEMBL384075
SMILES COC(=O)CCCC(=O)N1CCC(CNC(=O)NC23CC4CC(CC(C4)C2)C3)CC1
InChI Key InChIKey=OIUCRKOQFFYWPU-UHFFFAOYSA-N
Data  1 IC50
  Tab Delimited (TSV)   2D SDfile   Computed 3D by Vconf -m prep SDfile
Find this compound or compounds like it in BindingDB:
Activity Spreadsheet -- Enzyme Inhibition Constant Data from BindingDB
Found 1 hit for monomerid = 50191892
TargetBifunctional epoxide hydrolase 2(Homo sapiens (Human))
University Of California
Curated by ChEMBL
LigandPNGBDBM50191892(5-{4-[(3-adamantan-1-yl-ureido)-methyl]-piperidin-...)
Affinity DataIC50:  3.40nM. Assay description: Inhibition of soluble epoxide hydroxylase by kinetic fluorescent assay
In DepthDetails ArticlePubMed