BDBM50191964 3-(3'-chloro-biphenyl-4-yl)-4-cyano-5-ethyl-1-methyl-1H-pyrrole-2-carboxylic acid::CHEMBL217074
SMILES CCc1c(C#N)c(c(C(O)=O)n1C)-c1ccc(cc1)-c1cccc(Cl)c1
InChI Key InChIKey=JPAOOYFLLXHRNZ-UHFFFAOYSA-N
Data  4 EC50
  Tab Delimited (TSV)   2D SDfile   Computed 3D by Vconf -m prep SDfile
Find this compound or compounds like it in BindingDB:
Activity Spreadsheet -- Enzyme Inhibition Constant Data from BindingDB
Found 4 hits for monomerid = 50191964
TargetGlutamate receptor 4(Homo sapiens (Human))
Eli Lilly
Curated by ChEMBL
LigandPNGBDBM50191964(3-(3'-chloro-biphenyl-4-yl)-4-cyano-5-ethyl-1-meth...)
Affinity DataEC50: >3.00E+3nM. Assay description: Activity at human recombinant iGluR4 flop expressed in HEK293 cells measured as change in intracellular calcium ion concentration in presence of glut...
In DepthDetails ArticlePubMed
TargetGlutamate receptor 2(Homo sapiens (Human))
Eli Lilly
Curated by ChEMBL
LigandPNGBDBM50191964(3-(3'-chloro-biphenyl-4-yl)-4-cyano-5-ethyl-1-meth...)
Affinity DataEC50:  900nM. Assay description: Activity at human recombinant iGluR2 flop expressed in HEK293 cells measured as change in intracellular calcium ion concentration in presence of glut...
In DepthDetails ArticlePubMed
TargetGlutamate receptor 2(Homo sapiens (Human))
Eli Lilly
Curated by ChEMBL
LigandPNGBDBM50191964(3-(3'-chloro-biphenyl-4-yl)-4-cyano-5-ethyl-1-meth...)
Affinity DataEC50:  186nM. Assay description: Activity at human recombinant iGluR2 flip expressed in HEK293 cells measured as change in intracellular calcium ion concentration in presence of glut...
In DepthDetails ArticlePubMed
TargetGlutamate receptor 4(Homo sapiens (Human))
Eli Lilly
Curated by ChEMBL
LigandPNGBDBM50191964(3-(3'-chloro-biphenyl-4-yl)-4-cyano-5-ethyl-1-meth...)
Affinity DataEC50:  1.08E+3nM. Assay description: Activity at human recombinant iGluR4 flip expressed in HEK293 cells measured as change in intracellular calcium ion concentration in presence of glut...
In DepthDetails ArticlePubMed