BDBM50192015 CHEMBL3900522
SMILES CSCC[C@H](NC(=O)[C@@H](NC(=O)[C@@H](NC(=O)[C@H](Cc1ccc(O)cc1)NC(=O)[C@H](Cc1ccccc1)NC(=O)[C@H](C)NC(=O)[C@H](N)CCCCN)C(C)C)C(C)C)C(=O)N[C@@H](Cc1c[nH]c2ccccc12)C(=O)N[C@@H](CCCCN)C(=O)N[C@H](CCCCN)C(O)=O
InChI Key InChIKey=AUOMCVBVOYARFF-DZYYPJIBSA-N
Data  1 Kd
  Tab Delimited (TSV)   2D SDfile   Computed 3D by Vconf -m prep SDfile
Find this compound or compounds like it in BindingDB:
Activity Spreadsheet -- Enzyme Inhibition Constant Data from BindingDB
Found 1 hit for monomerid = 50192015
TargetLeukocyte surface antigen CD47(Homo sapiens (Human))
Sorbonne University
Curated by ChEMBL
LigandPNGBDBM50192015(CHEMBL3900522)
Affinity DataKd:  6.20E+3nM. Assay description: Binding affinity to CD47 receptor in human biotinylated MEC1 cell membranes by biolayer interferometry
In DepthDetails ArticlePubMed