BDBM50192067 Ac-Phe-[Orn-Pro-ala-Trp-Arg]::CHEMBL407285
SMILES C[C@H]1NC(=O)[C@@H]2CCCN2C(=O)[C@H](CCCNC(=O)[C@H](CCCN=C(N)N)NC(=O)[C@H](Cc2c[nH]c3ccccc23)NC1=O)NC(=O)[C@H](Cc1ccccc1)NC(C)=O
InChI Key InChIKey=FDLWVTUXYSIUCI-LFXFVITASA-N
Data  1 IC50
  Tab Delimited (TSV)   2D SDfile   Computed 3D by Vconf -m prep SDfile
Find this compound or compounds like it in BindingDB:
Activity Spreadsheet -- Enzyme Inhibition Constant Data from BindingDB
Found 1 hit for monomerid = 50192067
TargetC5a anaphylatoxin chemotactic receptor 1(Homo sapiens (Human))
Jerini
Curated by ChEMBL
LigandPNGBDBM50192067(Ac-Phe-[Orn-Pro-ala-Trp-Arg] | CHEMBL407285)
Affinity DataIC50:  5.50E+4nM. Assay description: Antagonist activity at human C5aR in CD88 transfected RBL cells assessed as inhibition of C5a-induced glucosaminidase release
In DepthDetails ArticlePubMed