BDBM50192108 4-(aminomethyl)phenylboronic acid hydrochloride::CHEMBL425786
SMILES NCc1ccc(cc1)B(O)O
InChI Key InChIKey=KMWLUGSVWULTHR-UHFFFAOYSA-N
Data  1 IC50
  Tab Delimited (TSV)   2D SDfile   Computed 3D by Vconf -m prep SDfile
Find this compound or compounds like it in BindingDB:
Activity Spreadsheet -- Enzyme Inhibition Constant Data from BindingDB
Found 1 hit for monomerid = 50192108
TargetCoagulation factor XI(Homo sapiens (Human))
Daiichi Asubio Medical Research Laboratories
Curated by ChEMBL
LigandPNGBDBM50192108(4-(aminomethyl)phenylboronic acid hydrochloride | ...)
Affinity DataIC50:  7.73E+4nM. Assay description: Inhibition of f11a
In DepthDetails ArticlePubMed