BDBM50192490 (7,8-dimethoxy-10,11-dihydro-5-oxa-2,4,11-triaza-dibenzo[a,d]cyclohepten-1-yl)-(4-fluoro-phenyl)-amine::CHEMBL386998
SMILES COc1cc2CNc3c(Nc4ccc(F)cc4)ncnc3Oc2cc1OC
InChI Key InChIKey=VXNUNRFSHHUSIE-UHFFFAOYSA-N
Data  3 IC50
  Tab Delimited (TSV)   2D SDfile   Computed 3D by Vconf -m prep SDfile
Find this compound or compounds like it in BindingDB:
Activity Spreadsheet -- Enzyme Inhibition Constant Data from BindingDB
Found 3 hits for monomerid = 50192490
TargetEpidermal growth factor receptor(Homo sapiens (Human))
Imclone Systems
Curated by ChEMBL
LigandPNGBDBM50192490((7,8-dimethoxy-10,11-dihydro-5-oxa-2,4,11-triaza-d...)
Affinity DataIC50:  7.60E+3nM. Assay description: Inhibition of EGFR autophosphorylation in DiFi cells by ELISA
In DepthDetails ArticlePubMed
TargetVascular endothelial growth factor receptor 2(Homo sapiens (Human))
Imclone Systems
Curated by ChEMBL
LigandPNGBDBM50192490((7,8-dimethoxy-10,11-dihydro-5-oxa-2,4,11-triaza-d...)
Affinity DataIC50: >1.00E+4nM. Assay description: Inhibition of KDR measured as pGAT-biotin peptide phosphorylation by HTRF assay
In DepthDetails ArticlePubMed
TargetEpidermal growth factor receptor(Homo sapiens (Human))
Imclone Systems
Curated by ChEMBL
LigandPNGBDBM50192490((7,8-dimethoxy-10,11-dihydro-5-oxa-2,4,11-triaza-d...)
Affinity DataIC50:  7.10E+3nM. Assay description: Inhibition of EGFR measured as pGAT-biotin peptide phosphorylation in presence of 2.0 uM ATP by HTRF assay
In DepthDetails ArticlePubMed