BDBM50192627 CHEMBL215695::N-((1R,3R,6R)-6-(3-((dimethylamino)methyl)phenyl)bicyclo[4.1.0]heptan-3-yl)-5,6-difluoro-N-(3-(4-methylpiperazin-1-yl)propyl)-1H-benzo[d]imidazol-2-amine
SMILES CN(C)Cc1cccc(c1)[C@@]12C[C@@H]1C[C@@H](CC2)N(CCCN1CCN(C)CC1)c1nc2cc(F)c(F)cc2[nH]1
InChI Key InChIKey=UHWJCLZESHKMAC-NVDQFQLTSA-N
Data  1 KI
  Tab Delimited (TSV)   2D SDfile   Computed 3D by Vconf -m prep SDfile
Find this compound or compounds like it in BindingDB:
Activity Spreadsheet -- Enzyme Inhibition Constant Data from BindingDB
Found 1 hit for monomerid = 50192627
TargetMelanin-concentrating hormone receptor 1(Homo sapiens (Human))
Schering-Plough Research Institute
Curated by ChEMBL
LigandPNGBDBM50192627(CHEMBL215695 | N-((1R,3R,6R)-6-(3-((dimethylamino)...)
Affinity DataKi:  328nM. Assay description: Binding activity against human MCH-R1
In DepthDetails ArticlePubMed