BDBM50192694 CHEMBL3960151
SMILES Fc1ccc(cc1)C1CC(=NN1C(=O)Nc1ccncc1)c1ccccc1
InChI Key InChIKey=IAQPONQUFBLUJV-UHFFFAOYSA-N
Data  2 IC50
  Tab Delimited (TSV)   2D SDfile   Computed 3D by Vconf -m prep SDfile
Find this compound or compounds like it in BindingDB:
Activity Spreadsheet -- Enzyme Inhibition Constant Data from BindingDB
Found 2 hits for monomerid = 50192694
TargetVoltage-dependent L-type calcium channel subunit alpha-1C(Homo sapiens (Human))
Actelion Pharmaceuticals
Curated by ChEMBL
LigandPNGBDBM50192694(CHEMBL3960151)
Affinity DataIC50:  3.09E+3nM. Assay description: Inhibition of recombinant T-type calcium channel Cav1.2 (unknown origin) expressed in HEK293 cells assessed as inhibition of Kcl-induced calcium infl...
In DepthDetails ArticlePubMed
TargetVoltage-dependent T-type calcium channel subunit alpha-1H(Homo sapiens (Human))
Actelion Pharmaceuticals
Curated by ChEMBL
LigandPNGBDBM50192694(CHEMBL3960151)
Affinity DataIC50:  202nM. Assay description: Inhibition of recombinant T-type calcium channel Cav3.2 (unknown origin) expressed in HEK293 cells assessed as inhibition of CaCl2-induced calcium in...
In DepthDetails ArticlePubMed