BDBM50192714 1-(4-methoxyphenyl)-3-{19-methyl-14-oxo-3-propyl-3,13,19,20-tetraazahexacyclo[14.7.0.0^{2,10}.0^{4,9}.0^{11,15}.0^{17,21}]tricosa-1(16),2(10),4,6,8,11(15),17,20-octaen-7-yl}urea::CHEMBL218201
SMILES CCCn1c2ccc(NC(=O)Nc3ccc(OC)cc3)cc2c2c3CNC(=O)c3c3-c4cn(C)nc4CCc3c12
InChI Key InChIKey=XCSJZQINTSVQMV-UHFFFAOYSA-N
Data  2 IC50
  Tab Delimited (TSV)   2D SDfile   Computed 3D by Vconf -m prep SDfile
Find this compound or compounds like it in BindingDB:
Activity Spreadsheet -- Enzyme Inhibition Constant Data from BindingDB
Found 2 hits for monomerid = 50192714
TargetVascular endothelial growth factor receptor 2(Homo sapiens (Human))
Cephalon
Curated by ChEMBL
LigandPNGBDBM50192714(1-(4-methoxyphenyl)-3-{19-methyl-14-oxo-3-propyl-3...)
Affinity DataIC50:  16nM. Assay description: Inhibition of VEGFR2
In DepthDetails ArticlePubMed
TargetAngiopoietin-1 receptor(Homo sapiens (Human))
Cephalon
Curated by ChEMBL
LigandPNGBDBM50192714(1-(4-methoxyphenyl)-3-{19-methyl-14-oxo-3-propyl-3...)
Affinity DataIC50:  2nM. Assay description: Inhibition of Tie2
In DepthDetails ArticlePubMed