BDBM50192866 CHEMBL3358981
SMILES COc1ccc2c(c[nH]c2c1)-c1c[nH]c(=O)c(n1)-c1cc(OC)c(OC)c(OC)c1
InChI Key InChIKey=FSSVUOAMGLPSIE-UHFFFAOYSA-N
Data  1 IC50
  Tab Delimited (TSV)   2D SDfile   Computed 3D by Vconf -m prep SDfile
Find this compound or compounds like it in BindingDB:
Activity Spreadsheet -- Enzyme Inhibition Constant Data from BindingDB
Found 1 hit for monomerid = 50192866
TargetPlatelet-derived growth factor receptor beta(Homo sapiens (Human))
Christian-Albrechts-University Of Kiel
Curated by ChEMBL
LigandPNGBDBM50192866(CHEMBL3358981)
Affinity DataIC50:  2.00E+3nM. Assay description: Inhibition of human recombinant PDGFRbeta using poly(Ala,Glu,Lys,Tyr) substrate
In DepthDetails ArticlePubMed