BDBM50192951 (S)-2-[4-(3-adamantan-1-yl-ureido)-butyrylamino]-propionic acid::CHEMBL425976
SMILES C[C@H](NC(=O)CCCNC(=O)NC12CC3CC(CC(C3)C1)C2)C(O)=O
InChI Key InChIKey=GNKSOGDQIDSREL-IWERZKIRSA-N
Data  1 IC50
  Tab Delimited (TSV)   2D SDfile   Computed 3D by Vconf -m prep SDfile
Find this compound or compounds like it in BindingDB:
Activity Spreadsheet -- Enzyme Inhibition Constant Data from BindingDB
Found 1 hit for monomerid = 50192951
TargetBifunctional epoxide hydrolase 2(Mus musculus (Mouse))
University Of California
Curated by ChEMBL
LigandPNGBDBM50192951((S)-2-[4-(3-adamantan-1-yl-ureido)-butyrylamino]-p...)
Affinity DataIC50: >1.00E+5nM. Assay description: Inhibition of mouse recombinant soluble Epoxide hydrolase
In DepthDetails ArticlePubMed