BDBM50192984 (S)-2-[4-(3-adamantan-1-yl-ureido)-butyrylamino]-4-methylsulfanyl-butyric acid::CHEMBL425817
SMILES CSCC[C@H](NC(=O)CCCNC(=O)NC12CC3CC(CC(C3)C1)C2)C(O)=O
InChI Key InChIKey=FRVCMZCFKITWEP-OCABNYQQSA-N
Data  1 IC50
  Tab Delimited (TSV)   2D SDfile   Computed 3D by Vconf -m prep SDfile
Find this compound or compounds like it in BindingDB:
Activity Spreadsheet -- Enzyme Inhibition Constant Data from BindingDB
Found 1 hit for monomerid = 50192984
TargetBifunctional epoxide hydrolase 2(Mus musculus (Mouse))
University Of California
Curated by ChEMBL
LigandPNGBDBM50192984((S)-2-[4-(3-adamantan-1-yl-ureido)-butyrylamino]-4...)
Affinity DataIC50:  4.80E+3nM. Assay description: Inhibition of mouse recombinant soluble Epoxide hydrolase
In DepthDetails ArticlePubMed