BDBM50192988 (S)-1-[4-(3-adamantan-1-yl-ureido)-butyryl]-pyrrolidine-2-carboxylic acid::CHEMBL220409
SMILES OC(=O)[C@@H]1CCCN1C(=O)CCCNC(=O)NC12CC3CC(CC(C3)C1)C2
InChI Key InChIKey=XWASDJAVTMCGMG-OCABNYQQSA-N
Data  1 IC50
  Tab Delimited (TSV)   2D SDfile   Computed 3D by Vconf -m prep SDfile
Find this compound or compounds like it in BindingDB:
Activity Spreadsheet -- Enzyme Inhibition Constant Data from BindingDB
Found 1 hit for monomerid = 50192988
TargetBifunctional epoxide hydrolase 2(Mus musculus (Mouse))
University Of California
Curated by ChEMBL
LigandPNGBDBM50192988((S)-1-[4-(3-adamantan-1-yl-ureido)-butyryl]-pyrrol...)
Affinity DataIC50:  8.20E+4nM. Assay description: Inhibition of mouse recombinant soluble Epoxide hydrolase
In DepthDetails ArticlePubMed