BDBM50193114 CHEMBL3958547
SMILES CC1=CC(=O)N(Nc2nc(nc3sc(C)cc23)-c2cccs2)C1=O
InChI Key InChIKey=ODPHUKUFZYZGJJ-UHFFFAOYSA-N
Data  1 IC50
  Tab Delimited (TSV)   2D SDfile   Computed 3D by Vconf -m prep SDfile
Find this compound or compounds like it in BindingDB:
Activity Spreadsheet -- Enzyme Inhibition Constant Data from BindingDB
Found 1 hit for monomerid = 50193114
TargetReceptor-type tyrosine-protein kinase FLT3(Homo sapiens (Human))
Yonsei University
Curated by ChEMBL
LigandPNGBDBM50193114(CHEMBL3958547)
Affinity DataIC50:  17nM. Assay description: Inhibition of recombinant human FLT3 expressed in insect Sf21 cells preincubated for 15 mins followed by poly(Glu:Tyr) substrate addition for 30 mins...
In DepthDetails ArticlePubMed