BDBM50193345 (E)-1-(2,4-dichlorophenyl)-3-(4-pyridin-2-ylpiperazin-1-yl)-propan-1-one O-methyloxime::CHEMBL209759
SMILES CO\N=C(/CCN1CCN(CC1)c1ccccn1)c1ccc(Cl)cc1Cl
InChI Key InChIKey=QBMRBRMWFXMMQU-PTGBLXJZSA-N
Data  1 IC50  2 EC50
  Tab Delimited (TSV)   2D SDfile   Computed 3D by Vconf -m prep SDfile
Find this compound or compounds like it in BindingDB:
Activity Spreadsheet -- Enzyme Inhibition Constant Data from BindingDB
Found 3 hits for monomerid = 50193345
TargetD(4) dopamine receptor(Homo sapiens (Human))
Abbott Laboratories
Curated by ChEMBL
LigandPNGBDBM50193345((E)-1-(2,4-dichlorophenyl)-3-(4-pyridin-2-ylpipera...)
Affinity DataEC50:  249nM. Assay description: Activity at human recombinant D4.4 receptor expressed in HEK293 cells by FLIPR assay
In DepthDetails ArticlePubMed
TargetD(2) dopamine receptor(Homo sapiens (Human))
Abbott Laboratories
Curated by ChEMBL
LigandPNGBDBM50193345((E)-1-(2,4-dichlorophenyl)-3-(4-pyridin-2-ylpipera...)
Affinity DataIC50: >1.00E+4nM. Assay description: Antagonist activity at human recombinant D2 receptor expressed in HEK293 cells by FLIPR assay
In DepthDetails ArticlePubMed
TargetD(2) dopamine receptor(Homo sapiens (Human))
Abbott Laboratories
Curated by ChEMBL
LigandPNGBDBM50193345((E)-1-(2,4-dichlorophenyl)-3-(4-pyridin-2-ylpipera...)
Affinity DataEC50: >1.00E+4nM. Assay description: Agonist activity at human recombinant D2 receptor expressed in HEK293 cells by FLIPR assay
In DepthDetails ArticlePubMed